Naphthalene, 2-(methoxymethyl)-

Reaction thermochemistry data

Data compiled by: Hussein Y. Afeefy, Joel F. Liebman, and Stephen E. Stein

Individual Reactions

1H-Cyclopropa[b]naphthalene + Methyl Alcohol = Naphthalene, 2-(methoxymethyl)-

By formula: C11H8 + CH4O = C12H12O

Quantity Value Units Method Reference Comment
Δr-198.4 ± 0.50kJ/molCmBillups, Chow, et al., 1973liquid phase; solvent: Methanol

References

Billups, Chow, et al., 1973
Billups, W.E.; Chow, W.Y.; Leavell, K.H.; Lewis, E.S.; Margrave, J.L.; Sass, R.L.; Shieh, J.J.; Werness, P.G.; Wood, J.L., Structure and thermochemistry of benzocyclopropenes. Bond fixation and strain energy, J. Am. Chem. Soc., 1973, 95, 7878-7880. [all data]