Naphthalene, 6-(1,1-dimethylethyl)-1,2,3,4-tetrahydro-

Reaction thermochemistry data

Data compiled by: Hussein Y. Afeefy, Joel F. Liebman, and Stephen E. Stein

Individual Reactions

Naphthalene, 2-(1,1-dimethylethyl)-1,2,3,4-tetrahydro- = Naphthalene, 6-(1,1-dimethylethyl)-1,2,3,4-tetrahydro-

By formula: C14H20 = C14H20

Quantity Value Units Method Reference Comment
Δr-5.4kJ/molEqkNieuwstad, Klapwijk, et al., 1973liquid phase

References

Nieuwstad, Klapwijk, et al., 1973
Nieuwstad, Th.J.; Klapwijk, P.; Van Bekkum, H., Hydrogenation of alkyl-substituted naphthalenes over palladium, J. Catal., 1973, 29, 404-411. [all data]