2H-1-Benzopyran-2-one, 7-(diethylamino)-4-(trifluoromethyl)-

Phase change data

Data compiled by: William E. Acree, Jr., James S. Chickos

Enthalpy of fusion

ΔfusH (kJ/mol) Temperature (K) Method Reference
23.3360.DSCZhang, Huang, et al., 1991

References

Zhang, Huang, et al., 1991
Zhang, Xing-Kang; Huang, Wei-Jun; Tan, Fu; Xu, Guang-Zhi; Wu, Zheng-Liang, Study on Thermodynamic Characteristics of 4-Trifluorocoumarin Derivatives, Acta Phys. Chim. Sin., 1991, 7, 1, 106-109, https://doi.org/10.3866/PKU.WHXB19910118 . [all data]