Diphosphene

Reaction thermochemistry data

Data compiled by: John E. Bartmess

Individual Reactions

HP2- + Hydrogen cation = H2P2

By formula: HP2- + H+ = H2P2

Quantity Value Units Method Reference Comment
Δr1490. ± 13.kJ/molG+TSO'Hair, Krempp, et al., 1992gas phase; Acidity between MeNO2, tBuSH
Quantity Value Units Method Reference Comment
Δr1456. ± 13.kJ/molIMRBO'Hair, Krempp, et al., 1992gas phase; Acidity between MeNO2, tBuSH

Gas phase ion energetics data

Data compiled as indicated in comments:
B - John E. Bartmess
RDSH - Henry M. Rosenstock, Keith Draxl, Bruce W. Steiner, and John T. Herron

Electron affinity determinations

EA (eV) Method Reference Comment
1.000 ± 0.010LPESErvin and Lineberger, 2005Trans isomer; B
1.030 ± 0.010LPESErvin and Lineberger, 2005cis isomer; B

Ionization energy determinations

IE (eV) Method Reference Comment
10.2 ± 0.2EIFehlner and Callen, 1968RDSH

Appearance energy determinations

Ion AE (eV) Other Products MethodReferenceComment
P2H+13.3 ± 0.4HEIFehlner and Callen, 1968RDSH
P2+11.9 ± 0.4?EIFehlner and Callen, 1968RDSH

De-protonation reactions

HP2- + Hydrogen cation = H2P2

By formula: HP2- + H+ = H2P2

Quantity Value Units Method Reference Comment
Δr356.2 ± 3.1kcal/molG+TSO'Hair, Krempp, et al., 1992gas phase; Acidity between MeNO2, tBuSH; B
Quantity Value Units Method Reference Comment
Δr348.0 ± 3.0kcal/molIMRBO'Hair, Krempp, et al., 1992gas phase; Acidity between MeNO2, tBuSH; B

References

O'Hair, Krempp, et al., 1992
O'Hair, R.A.J.; Krempp, M.; Damrauer, R.; Depuy, C.H., Gas-Phase Ion Chemistry of HP2(-), FP2(-), and HP2(+), Inorg. Chem., 1992, 31, 11, 2092, https://doi.org/10.1021/ic00037a021 . [all data]