Octadecanoic acid, 2-chloro-, methyl ester

Kovats' RI, non-polar column, isothermal

Data compiled by: NIST Mass Spectrometry Data Center, William E. Wallace, director

Column type CapillaryCapillary
Active phase SE-30SE-30
Column length (m) 25.25.
Carrier gas N2N2
Substrate
Column diameter (mm) 0.220.22
Phase thickness (μm)
Temperature (C) 180.200.
I 2265.2254.
ReferenceHaken and Korhonen, 1984Haken and Korhonen, 1984
Comment MSDC-RI MSDC-RI

Kovats' RI, polar column, isothermal

View large format table.

Column type Active phase Temperature (C) I Reference Comment
CapillaryCarbowax 20M180.2657.Haken and Korhonen, 1984N2; Column length: 22. m; Column diameter: 0.3 mm
CapillaryCarbowax 20M200.2642.Haken and Korhonen, 1984N2; Column length: 22. m; Column diameter: 0.3 mm

References

Haken and Korhonen, 1984
Haken, J.K.; Korhonen, I.O.O., Gas chromatography of homologous esters. XXV. Capillary column studies of monochlorinated C5-C18 n-carboxylic esters, J. Chromatogr., 1984, 298, 89-100, https://doi.org/10.1016/S0021-9673(01)92697-4 . [all data]