2-Propanol, 1-chloro-3-methoxy-

Van Den Dool and Kratz RI, non-polar column, temperature ramp

View large format table.

Column type Active phase I Reference Comment
CapillaryVF-5MS904.N/A30. m/0.25 mm/0.25 μm, He; Tstart: 60. C; Tend: 270. C

Normal alkane RI, non-polar column, temperature ramp

View large format table.

Column type Active phase I Reference Comment
PackedSE-30900.Zenkevich and Drugov, 1987Helium, Chromosorb W (60-80 mesh), 50. C @ 0. min, 5. K/min, 150. C @ 0. min; Column length: 1.8 m

References

Zenkevich and Drugov, 1987
Zenkevich, I.G.; Drugov, M.V., Chromato Mass Spectrometric Characterization of Alkoxychlorohydrines and their Trimethylsilyl Ethers, Theoretical and Experim. Chemistry (Rus.), 1987, 225-230. [all data]