1,1'-Biphenyl, 2,2',3',4,5-Pentachloro-

Normal alkane RI, non-polar column, isothermal

Data compiled by: NIST Mass Spectrometry Data Center, William E. Wallace, director

Column type CapillaryCapillaryCapillaryCapillaryCapillary
Active phase Apiezon LApiezon LApiezon LApiezon LApiezon L
Column length (m) 40.40.40.40.15.
Carrier gas H2H2H2H2He
Substrate
Column diameter (mm) 0.300.300.300.300.20
Phase thickness (μm)
Temperature (C) 180.180.180.180.205.
I 2157.2157.2158.2158.2175.
ReferenceBallschmiter and Zell, 1980Ballschmiter and Zell, 1980Ballschmiter and Zell, 1980Ballschmiter and Zell, 1980Sissons and Welti, 1971
Comment MSDC-RI MSDC-RI MSDC-RI MSDC-RI MSDC-RI

References

Ballschmiter and Zell, 1980
Ballschmiter, K.; Zell, M., Analysis of polychlorinated biphenyls (PCB) by glass capillary gas chromatography, Fresenius Z. Anal. Chem., 1980, 302, 1, 20-31, https://doi.org/10.1007/BF00469758 . [all data]

Sissons and Welti, 1971
Sissons, D.; Welti, D., Structural Identification of Polychlorinated Biphenyls in Commercial Mixtures by Gas-Liquid Chromatography, Nuclear Magnetic Resonance and Mass Spectrometry, J. Chromatogr., 1971, 60, 15-32, https://doi.org/10.1016/S0021-9673(00)95526-2 . [all data]