5-Tetradecene, (Z)-

Kovats' RI, non-polar column, isothermal

View large format table.

Column type Active phase Temperature (C) I Reference Comment
CapillarySqualane100.1372.Heinzen, Soares, et al., 1999
CapillarySE-30120.1384.Gusev, Sokolov, et al., 1989H2; Column length: 40. m; Column diameter: 0.30 mm
CapillaryOV-101110.1383.Rang, Kuningas, et al., 1987He; Column length: 50. m; Column diameter: 0.25 mm
CapillarySqualane74.1370.9Soják, Kraus, et al., 1982Column length: 62. m; Column diameter: 0.25 mm
CapillarySqualane100.1372.Sojak, Hrivnak, et al., 1973
CapillarySqualane130.1375.Sojak, Hrivnak, et al., 1973

Kovats' RI, polar column, isothermal

View large format table.

Column type Active phase Temperature (C) I Reference Comment
CapillaryPEG-20M80.1420.5Orav, Kuningas, et al., 1993100. m/0.25 mm/0.12 μm
CapillaryPEG-20M80.1427.1Orav, Kuningas, et al., 1993100. m/0.25 mm/0.24 μm
CapillaryPEG-20M80.1428.Orav, Kuningas, et al., 199360. m/0.32 mm/0.25 μm
CapillaryPEG-20M65.1417.Rang, Orav, et al., 1988
CapillaryPEG-20M65.1424.Rang, Orav, et al., 1988
CapillaryPEG-20M65.1424.Rang, Orav, et al., 1988
CapillaryPEG-20M65.1424.Rang, Orav, et al., 1988
CapillaryPEG-20M70.1419.Rang, Orav, et al., 1988
CapillaryPEG-20M70.1424.Rang, Orav, et al., 1988
CapillaryPEG-20M70.1425.Rang, Orav, et al., 1988
CapillaryPEG-20M70.1425.Rang, Orav, et al., 1988
CapillaryPEG-20M80.1419.Rang, Orav, et al., 1988
CapillaryPEG-20M80.1427.Rang, Orav, et al., 1988
CapillaryPEG-20M80.1427.Rang, Orav, et al., 1988
CapillaryPEG 4000100.1436.Rang, Orav, et al., 1988
CapillaryPEG 4000110.1437.Rang, Orav, et al., 1988
CapillaryPEG 4000120.1438.Rang, Orav, et al., 1988
CapillaryPEG 4000140.1441.Rang, Orav, et al., 1988
CapillaryPEG 4000160.1443.Rang, Orav, et al., 1988
CapillaryPEG-20M120.1433.Rang, Orav, et al., 1988
CapillaryPEG-20M130.1434.Rang, Orav, et al., 1988
CapillaryPEG-20M140.1435.Rang, Orav, et al., 1988
CapillaryPEG-20M150.1436.Rang, Orav, et al., 1988
CapillaryPEG-20M160.1438.Rang, Orav, et al., 1988
CapillaryPEG-20M65.1416.1Orav, Kuningas, et al., 1985Column length: 100. m; Column diameter: 0.25 mm
CapillaryPEG-20M65.1424.4Orav, Kuningas, et al., 1985Column length: 100. m; Column diameter: 0.25 mm
CapillaryPEG-20M70.1417.9Orav, Kuningas, et al., 1985Column length: 100. m; Column diameter: 0.25 mm
CapillaryPEG-20M70.1425.3Orav, Kuningas, et al., 1985Column length: 100. m; Column diameter: 0.25 mm
CapillaryPEG-20M65.1413.6Orav, Kuningas, et al., 1985Column length: 50. m; Column diameter: 0.25 mm
CapillaryPEG-20M65.1417.Orav, Kuningas, et al., 1985Column length: 50. m; Column diameter: 0.25 mm
CapillaryPEG-20M65.1423.6Orav, Kuningas, et al., 1985Column length: 50. m; Column diameter: 0.25 mm
CapillaryPEG-20M65.1424.4Orav, Kuningas, et al., 1985Column length: 50. m; Column diameter: 0.25 mm
CapillaryPEG-20M70.1416.1Orav, Kuningas, et al., 1985Column length: 50. m; Column diameter: 0.25 mm
CapillaryPEG-20M70.1418.6Orav, Kuningas, et al., 1985Column length: 50. m; Column diameter: 0.25 mm
CapillaryPEG-20M70.1424.3Orav, Kuningas, et al., 1985Column length: 50. m; Column diameter: 0.25 mm
CapillaryPEG-20M70.1424.6Orav, Kuningas, et al., 1985Column length: 50. m; Column diameter: 0.25 mm
CapillaryPEG 4000100.1436.Rang, Kuningas, et al., 1977Column diameter: 0.25 mm
CapillaryPEG 4000120.1438.Rang, Kuningas, et al., 1977Column diameter: 0.25 mm
CapillaryPEG 4000140.1441.Rang, Kuningas, et al., 1977Column diameter: 0.25 mm
CapillaryPEG 4000160.1443.Rang, Kuningas, et al., 1977Column diameter: 0.25 mm

Normal alkane RI, non-polar column, custom temperature program

View large format table.

Column type Active phase I Reference Comment
CapillaryPolydimethyl siloxane1372.Junkes, Castanho, et al., 2003Program: not specified

References

Heinzen, Soares, et al., 1999
Heinzen, V.E.F.; Soares, M.F.; Yunes, R.A., Semi-empirical topological method for the prediction of the chromatographic retention of cis- and trans-alkene isomers and alkanes, J. Chromatogr. A, 1999, 849, 2, 495-506, https://doi.org/10.1016/S0021-9673(99)00530-0 . [all data]

Gusev, Sokolov, et al., 1989
Gusev, G.M.; Sokolov, V.P.; Yurov, V.V.; Kuznetsov, A.V.; Potatuev, A.A., Identification of olefins during hydrocarboxylation, Zh. Anal. Khim., 1989, 44, 551-555. [all data]

Rang, Kuningas, et al., 1987
Rang, S.; Kuningas, K.; Strenze, T.; Orav, A.; Eisen, O., Retention and Thermodynamics of Solution of n-Alkenes in OV-101, J. Chromatogr., 1987, 406, 75-80, https://doi.org/10.1016/S0021-9673(00)94018-4 . [all data]

Soják, Kraus, et al., 1982
Soják, L.; Kraus, G.; Farkas, P.; Ostovský, I., Hochleistungs-gaschromatographie an flüssigkristall-glaskapillaren. V. Trennung von isomeren n-tridecenen und n-tetradecenen, J. Chromatogr., 1982, 238, 1, 51-57, https://doi.org/10.1016/S0021-9673(00)82710-7 . [all data]

Sojak, Hrivnak, et al., 1973
Sojak, L.; Hrivnak, J.; Majer, P.; Janak, J., Capillary Gas Chromatography of Linear Alkenes on Squalane, Anal. Chem., 1973, 45, 2, 293-302, https://doi.org/10.1021/ac60324a039 . [all data]

Orav, Kuningas, et al., 1993
Orav, A.; Kuningas, K.; Rang, S., A comparison of different retention index systems with unsaturated and aromatic hydrocarbons in capillary gas chromatography on PEG 20MK, Chromatographia, 1993, 37, 7/8, 411-414, https://doi.org/10.1007/BF02272257 . [all data]

Rang, Orav, et al., 1988
Rang, S.A.; Orav, A.E.; Kuningas, K.R.; Meister, A.E.; Strense, T.V.; Eisen, O.G., Gas-Chromatographic Characteristics of unsaturated hydrocarbons, Academy of Sciences of Estonia SSR, Tallinn, Estonia SSR, 1988, 208. [all data]

Orav, Kuningas, et al., 1985
Orav, A.; Kuningas, K.; Rang, S.; Eisen, O., Capillary gas chromatography of n-tridecenes, n-tetradecenes and C10-C14 n-alkynes on polyethylene glycol 20m of different polarity, Eesti NSV Tead. Akad. Toim. Keem., 1985, 34, 2, 105-113. [all data]

Rang, Kuningas, et al., 1977
Rang, S.; Kuningas, K.; Orav, A.; Eisen, O., Capillary Gas Chromatography of C6-C14 n-Alkenes on Polyphenyl Ether and Polyethylene Glycol 4000, Chromatographia, 1977, 10, 2, 55-64, https://doi.org/10.1007/BF02274460 . [all data]

Junkes, Castanho, et al., 2003
Junkes, B.S.; Castanho, R.D.M.; Amboni, C.; Yunes, R.A.; Heinzen, V.E.F., Semiempirical Topological Index: A Novel Molecular Descriptor for Quantitative Structure-Retention Relationship Studies, Internet Electronic Journal of Molecular Design, 2003, 2, 1, 33-49. [all data]