2,3,4,4',5,6-Hexachloro-1,1'-biphenyl

Normal alkane RI, non-polar column, custom temperature program

View large format table.

Column type Active phase I Reference Comment
CapillaryApiezon L2375.Ballschmiter and Zell, 1980H2; Column length: 40. m; Column diameter: 0.30 mm; Program: not specified

References

Ballschmiter and Zell, 1980
Ballschmiter, K.; Zell, M., Analysis of polychlorinated biphenyls (PCB) by glass capillary gas chromatography, Fresenius Z. Anal. Chem., 1980, 302, 1, 20-31, https://doi.org/10.1007/BF00469758 . [all data]