Nipecotamide

Phase change data

Data compiled by: William E. Acree, Jr., James S. Chickos

Quantity Value Units Method Reference Comment
Δsub112.5 ± 1.3kJ/molCRibeiro da Silva and Cabral, 2007

References

Ribeiro da Silva and Cabral, 2007
Ribeiro da Silva, Manuel A.V.; Cabral, Joana I.T.A., Thermochemical study of 1-, 3- and 4-piperidinecarboxamide derivatives, Thermochimica Acta, 2007, 453, 2, 147-151, https://doi.org/10.1016/j.tca.2006.11.008 . [all data]