Distearyl methyl amine

Phase change data

Data compiled by: Thermodynamics Research Center, NIST Boulder Laboratories, Chris Muzny director

Quantity Value Units Method Reference Comment
Tfus313.15KN/AStaudinger and Roessler, 1936Uncertainty assigned by TRC = 2. K

In addition to the Thermodynamics Research Center (TRC) data available from this site, much more physical and chemical property data is available from the following TRC products:

References

Staudinger and Roessler, 1936
Staudinger, H.; Roessler, K., Highly Polymerized Compounds. CXXIII. Viscosity Measurements on Long- Chain Aliphatic Amines., Chem. Ber., 1936, 69B, 49-60. [all data]