(E)(1-Propenyl) (2-methyl-1-propenyl)ether

Reaction thermochemistry data

Data compiled by: Hussein Y. Afeefy, Joel F. Liebman, and Stephen E. Stein

Individual Reactions

(E)(1-Propenyl) (2-methyl-1-propenyl)ether = C7H12O

By formula: C7H12O = C7H12O

Quantity Value Units Method Reference Comment
Δr-2.0 ± 0.3kJ/molEqkTaskinen and Virtanen, 1977liquid phase; solvent: Cyclohexane
Δr-2.7 ± 0.4kJ/molEqkTaskinen and Virtanen, 1977gas phase; solvent: Cyclohexane; Gas phase isomerization

References

Taskinen and Virtanen, 1977
Taskinen, E.; Virtanen, R., Thermocynamics of vinyl ethers. 19. Alkyl-substituted divinyl ethers, J. Org. Chem., 1977, 42, 1443-1449. [all data]