benzene, (1,1-dimethyl-4-pentenyl)-

Phase change data

Data compiled by: Thermodynamics Research Center, NIST Boulder Laboratories, Chris Muzny director

Quantity Value Units Method Reference Comment
Tboil498.KN/AZiegler, Dersch, et al., 1934Uncertainty assigned by TRC = 3. K

In addition to the Thermodynamics Research Center (TRC) data available from this site, much more physical and chemical property data is available from the following TRC products:

References

Ziegler, Dersch, et al., 1934
Ziegler, K.; Dersch, F.; Wollthan, H., Alkali Organic Compounds XI. Mechanism of Polymerizationof Unsaturated Hydrocarbons by Alkali Metal and Alkali ALkyls, Justus Liebigs Ann. Chem., 1934, 511, 13-44. [all data]