Benzene, 1,2-(methylenedioxy)-4-propenyl-, (E)-

Normal alkane RI, non-polar column, temperature ramp

View large format table.

Column type Active phase I Reference Comment
CapillaryZB-51374.Mohottalage, Tabacchi, et al., 200730. m/0.25 mm/0.25 μm, 60. C @ 5. min, 4. K/min, 220. C @ 20. min
CapillaryCP Sil 5 CB1354.Tesso, König, et al., 2006H2, 3. K/min; Column length: 25. m; Column diameter: 0.25 mm; Tstart: 50. C; Tend: 230. C

References

Mohottalage, Tabacchi, et al., 2007
Mohottalage, S.; Tabacchi, R.; Guerin, P.M., Components from Sri Lankan Piper betle L. leaf oil and their analogues showing toxicity against the housefly, Musca domestica, Flavour Fragr. J., 2007, 22, 2, 130-138, https://doi.org/10.1002/ffj.1770 . [all data]

Tesso, König, et al., 2006
Tesso, H.; König, W.A.; Son, P.T.; Giang, P.M., Composition of the essential oil of flowers of Chloranthus spicatus (Thunb.) Makino, Flavour Fragr. J., 2006, 21, 4, 592-597, https://doi.org/10.1002/ffj.1528 . [all data]