3-Pyridineacetic acid, 1,4-dihydro-1-methyl-, methyl ester

Gas phase ion energetics data

Data compiled by: Sharon G. Lias, Rhoda D. Levin, and Sherif A. Kafafi

Ionization energy determinations

IE (eV) Method Reference
6.94 ± 0.02EIHvistendahl and Undheim, 1972

References

Hvistendahl and Undheim, 1972
Hvistendahl, G.; Undheim, K., Mass spectrometry of onium compounds. Part XIV. Methiodides of methyl pyridylacetates, J. Chem. Soc. Perkin Trans. 2, 1972, 14, 2030. [all data]