Thiophene, 2-(butylthio)-

Kovats' RI, non-polar column, isothermal

View large format table.

Column type Active phase Temperature (C) I Reference Comment
CapillaryOV-101130.1290.Misharina, Aerov, et al., 199050. m/0.32 mm/0.5 μm, He
CapillaryOV-101140.1295.Misharina, Aerov, et al., 199050. m/0.32 mm/0.5 μm, He
CapillaryOV-101150.1299.Misharina, Aerov, et al., 199050. m/0.32 mm/0.5 μm, He

Van Den Dool and Kratz RI, non-polar column, temperature ramp

View large format table.

Column type Active phase I Reference Comment
CapillaryDB-11269.Rochat S., de Saint Laumer J.Y., et al., 200720. m/0.18 mm/0.18 μm, 60. C @ 3. min, 8. K/min, 220. C @ 5. min
CapillaryOV-1011290.Misharina, Golovnya, et al., 199350. m/0.32 mm/0.5 μm, He, 4. K/min; Tstart: 50. C; Tend: 200. C
CapillaryOV-1011289.Misharina, Aerov, et al., 199050. m/0.32 mm/0.5 μm, He, 4. K/min; Tstart: 50. C
CapillaryOV-1011284.Misharina, Aerov, et al., 199050. m/0.32 mm/0.5 μm, He, 2. K/min; Tstart: 80. C
CapillaryOV-1011291.Misharina, Aerov, et al., 199050. m/0.32 mm/0.5 μm, He, 4. K/min; Tstart: 80. C

References

Misharina, Aerov, et al., 1990
Misharina, T.A.; Aerov, A.F.; Golovnya, R.V., Gas Chromatographic infrared and mass spectrometric data for identification of isomeric alkylthienylsulphides, Zh. Anal. Khim., 1990, 45, 535-543. [all data]

Rochat S., de Saint Laumer J.Y., et al., 2007
Rochat S.; de Saint Laumer J.Y.; Chaintreau A., Analysis of sulfur compounds from the in-oven roast beef aroma by comprehensive two-dimensional gas chromatography, J. Chromatogr. A, 2007, 1147, 1, 85-94, https://doi.org/10.1016/j.chroma.2007.02.039 . [all data]

Misharina, Golovnya, et al., 1993
Misharina, T.A.; Golovnya, R.V.; Beletsky, I.V., Sorption properties of heterocyclic compounds differing by heteroatom in capillary gas chromatography, Russ. Chem. Bull. (Engl. Transl.), 1993, 42, 7, 1167-1170, https://doi.org/10.1007/BF00701998 . [all data]