Nitrendipine

Kovats' RI, non-polar column, temperature ramp

Data compiled by: NIST Mass Spectrometry Data Center, William E. Wallace, director

Column type Capillary
Active phase SPB-1
Column length (m) 15.
Carrier gas
Substrate
Column diameter (mm) 0.53
Phase thickness (μm) 2.
Tstart (C) 240.
Tend (C) 275.
Heat rate (K/min) 2.
Initial hold (min) 1.
Final hold (min) 1.
I 2659.11
ReferenceWachowiak, Strach, et al., 2005
Comment MSDC-RI

References

Wachowiak, Strach, et al., 2005
Wachowiak, R.; Strach, B.; Kopatka, P., Analiza toksykologiczna wybranych pochodnych 1,4-dihydropirydyny w diagnostyce zatruc. Toxicological analysis of selected 1,4-dihydropyridyne calcium channel blockers in the diagnosis of intoxications, Arch. Med. Sad. Krym., 2005, 55, 47-54. [all data]