3-Penten-1-ol

Kovats' RI, non-polar column, isothermal

View large format table.

Column type Active phase Temperature (C) I Reference Comment
PackedApiezon L120.717.Bogoslovsky, Anvaer, et al., 1978Celite 545
PackedApiezon L160.725.Bogoslovsky, Anvaer, et al., 1978Celite 545

Normal alkane RI, non-polar column, isothermal

View large format table.

Column type Active phase Temperature (C) I Reference Comment
PackedApieson L120.735.Kurdina, Markovich, et al., 1969not specified, not specified

References

Bogoslovsky, Anvaer, et al., 1978
Bogoslovsky, Yu.N.; Anvaer, B.I.; Vigdergauz, M.S., Chromatographic constants in gas chromatography (in Russian), Standards Publ. House, Moscow, 1978, 192. [all data]

Kurdina, Markovich, et al., 1969
Kurdina, Z.G.; Markovich, V.E.; Sakharov, V.M., Gas chromatography of cyclic O-containing compounds in Gas chromatography, Issue # 10, NIITEKhim, Moscow, 1969, 128-133. [all data]