5H-Cyclopentapyrazine, 6,7-dihydro-2,5-dimethyl-

Normal alkane RI, polar column, temperature ramp

Data compiled by: NIST Mass Spectrometry Data Center, William E. Wallace, director

Column type Capillary
Active phase FFAP
Column length (m) 50.
Carrier gas He
Substrate
Column diameter (mm) 0.28
Phase thickness (μm)
Tstart (C) 60.
Tend (C) 240.
Heat rate (K/min) 2.
Initial hold (min) 5.
Final hold (min)
I 1672.
ReferenceVernin, Metzger, et al., 1988
Comment MSDC-RI

References

Vernin, Metzger, et al., 1988
Vernin, G.; Metzger, J.; Obretenov, T.; Suon, K.-N.; Fraisse, D., GC/MS (EI,PCI,SIM)-data bank analysis of volatile compounds arising from thermal degradation of glucose-valine amadori intermediates in Flavors and Fragrances: A World Perspective. Proceedings of the 10th International Congress of Essential Oils, Fragrances and Flavors, Lawrence,B.M.; Mookherjee,B.D.; Willis,B.J., ed(s)., Elsevier, New York, 1988, 999-1028. [all data]