lithium valerate

Phase change data

Data compiled by: Eugene S. Domalski and Elizabeth D. Hearing

Enthalpy of phase transition

ΔHtrs (kJ/mol) Temperature (K) Initial Phase Final Phase Reference Comment
0.665209.3crystaline, IIIcrystaline, IIFranzosini, Ngeyi, et al., 1986
2.745319.06crystaline, IIcrystaline, IFranzosini, Ngeyi, et al., 1986

Entropy of phase transition

ΔStrs (J/mol*K) Temperature (K) Initial Phase Final Phase Reference Comment
3.24209.3crystaline, IIIcrystaline, IIFranzosini, Ngeyi, et al., 1986
16.13319.06crystaline, IIcrystaline, IFranzosini, Ngeyi, et al., 1986

References

Franzosini, Ngeyi, et al., 1986
Franzosini, P.; Ngeyi, S.P.; Westrum, E.F., Jr., Thermophysics of metal alkanoates. VI. Heat capacities and thermodynamic properties of lithium n-pentanoate and n-heptanoate, J. Chem. Thermodynam., 1986, 18, 1169-1181. [all data]