Bicyclo[4.4.1]undeca-1,3,5-triene

Gas phase thermochemistry data

Data compiled by: Hussein Y. Afeefy, Joel F. Liebman, and Stephen E. Stein

Quantity Value Units Method Reference Comment
Δfgas146.kJ/molChydRoth, Klarner, et al., 1992

References

Roth, Klarner, et al., 1992
Roth, W.R.; Klarner, F.-G.; Siepert, G.; Lennartz, H.-W., Zur Frage der Homoaromatizitat von Norcaradien und Cycloheptatrien, Chem. Ber., 1992, 125, 217-224. [all data]