Exo-2-ethylidenetetrahydrofuran

Reaction thermochemistry data

Data compiled by: Hussein Y. Afeefy, Joel F. Liebman, and Stephen E. Stein

Individual Reactions

Exo-2-ethylidenetetrahydrofuran = Endo-2-ethylidenetetrahydrofuran

By formula: C6H10O = C6H10O

Quantity Value Units Method Reference Comment
Δr-3.8 ± 0.2kJ/molEqkTaskinen, 1975liquid phase; solvent: Cyclohexane; GLC

References

Taskinen, 1975
Taskinen, E., Thermodynamics of vinyl ethers. XII. The relative stabilities of 2-alkylidenetetrahydrofurans and 5-alkyl-1-2,3-dihydrofurans, Acta Chem. Scand., Ser. B, 1975, 29, 245-248. [all data]