Methanediol, dinitrate

Condensed phase thermochemistry data

Data compiled by: Hussein Y. Afeefy, Joel F. Liebman, and Stephen E. Stein

Quantity Value Units Method Reference Comment
Δfliquid22.3kcal/molCcbDiCerrione, 1948
Quantity Value Units Method Reference Comment
Δcliquid-137.6kcal/molCcbDiCerrione, 1948

References

DiCerrione, 1948
DiCerrione, L.A., 30. The action of nitric acid on hexamethylenetetramine, Ann. Chim. Appl., 1948, 38, 225-271. [all data]