4-Quinolinol,1,4-diethyldecahydro-2-methyl-(2α,4β,4aα,8aβ)

Gas phase ion energetics data

Data compiled by: Sharon G. Lias, Rhoda D. Levin, and Sherif A. Kafafi

Ionization energy determinations

IE (eV) Method Reference
7.23 ± 0.02EIZaikin and Wulfson, 1978

Appearance energy determinations

Ion AE (eV) Other Products MethodReferenceComment
C12H22NO+9.90C2H5EIZaikin and Wulfson, 1978, 2
C13H24NO+9.18CH3EIZaikin and Wulfson, 1978

References

Zaikin and Wulfson, 1978
Zaikin, V.G.; Wulfson, N.S., Ionization and appearance potentials in organic chemistry, Org. Mass Spectrom., 1978, 13, 680. [all data]

Zaikin and Wulfson, 1978, 2
Zaikin, V.G.; Wulfson, N.S., Dissociation energies of axial and equatorial carbon-carbon bonds in substituted decahydroquinolols, Tetrahedron Lett., 1978, 32, 2935. [all data]