Carbamodithioic acid, dibutyl-, methyl ester

Kovats' RI, non-polar column, isothermal

View large format table.

Column type Active phase Temperature (C) I Reference Comment
PackedApiezon L250.1418.Onuska and Boos, 1973

References

Onuska and Boos, 1973
Onuska, F.I.; Boos, W.R., Gas Chromatographic and Mass Spectrometric Studies of S-Alkyl Derivatives of N,N-Dialkyl Dithiocarbamates, Anal. Chem., 1973, 45, 6, 967-971, https://doi.org/10.1021/ac60328a031 . [all data]