Ether, 2,2-dichloro-1,1-difluoroethyl propyl

Reaction thermochemistry data

Data compiled by: Hussein Y. Afeefy, Joel F. Liebman, and Stephen E. Stein

Individual Reactions

1-Propanol + Ethene, 1,1-dichloro-2,2-difluoro- = C5H8Cl2F2O

By formula: C3H8O + C2Cl2F2 = C5H8Cl2F2O

Quantity Value Units Method Reference Comment
Δr-164. ± 2.kJ/molCmKennedy, Lacher, et al., 1969gas phase

References

Kennedy, Lacher, et al., 1969
Kennedy, M.B.; Lacher, J.R.; Park, J.D., Reaction heats of organic compounds. VI. Heats of addition of some alcohols to 1,1-dichloro-2,2-difluoroethylene, Trans. Faraday Soc., 1969, 65, 1435-1442. [all data]