Androstane-3,16-diol, (3β,5α,16β)-, 2TMS derivative

Normal alkane RI, non-polar column, temperature ramp

Data compiled by: NIST Mass Spectrometry Data Center, William E. Wallace, director

Column type Packed
Active phase SE-30
Column length (m) 2.
Carrier gas N2
Substrate Gas Chrom Q
Column diameter (mm)
Phase thickness (μm)
Tstart (C) 150.
Tend (C) 300.
Heat rate (K/min) 4.
Initial hold (min)
Final hold (min)
I 2605.
ReferenceHarvey, 1980
Comment MSDC-RI

References

Harvey, 1980
Harvey, D.J., Vinyldimethylsilyl ethers as derivative for the characterization of steroids and cannabinoids by gas chromatography mass spectrometry, Biomed. Mass Spectrom., 1980, 7, 5, 211-216, https://doi.org/10.1002/bms.1200070507 . [all data]