3-Ethylthio-2-methyl-1-propene

Reaction thermochemistry data

Data compiled by: Hussein Y. Afeefy, Joel F. Liebman, and Stephen E. Stein

Individual Reactions

3-Ethylthio-2-methyl-1-propene = 1-Propene, 1-(ethylthio)-2-methyl-

By formula: C6H12S = C6H12S

Quantity Value Units Method Reference Comment
Δr-11.8 ± 1.5kJ/molEqkKimmelma, 1988liquid phase; solvent: DMSO; NMR

References

Kimmelma, 1988
Kimmelma, R., Structure-stability relationships in vinyl sulfides. III. Stabilization caused by different alkylthio and phenylthio groups attached to an olefinic double bond, Acta Chem. Scand., 1988, 42, 550-555. [all data]