4-Methyl-2H,7H-pyrano-[2,3-b]pyran-2,7-dione

Condensed phase thermochemistry data

Data compiled by: Hussein Y. Afeefy, Joel F. Liebman, and Stephen E. Stein

Quantity Value Units Method Reference Comment
Δfsolid-387. ± 20.kJ/molCcbSabbah, Chastel, et al., 1972Author's hf298_condensed=-385.±20. kJ/mol
Quantity Value Units Method Reference Comment
Δcsolid-4012. ± 20.kJ/molCcbSabbah, Chastel, et al., 1972Author's hf298_condensed=-385.±20. kJ/mol; Corresponding Δfsolid = -387. kJ/mol (simple calculation by NIST; no Washburn corrections)

References

Sabbah, Chastel, et al., 1972
Sabbah, R.; Chastel, R.; Laffitte, M., Determination des enthalpies de reference de formation a l'etat solide de quelques derives pyranno-pyranne diones, Thermochim. Acta, 1972, 4, 117-122. [all data]