Diazene,(nitrophenyl)phenyl-(E)-

Gas phase ion energetics data

Data compiled by: Sharon G. Lias, Rhoda D. Levin, and Sherif A. Kafafi

Ionization energy determinations

IE (eV) Method Reference Comment
9.05 ± 0.05PEMillefiori, Millefiori, et al., 1979Vertical value

References

Millefiori, Millefiori, et al., 1979
Millefiori, S.; Millefiori, A.; Pignataro, S.; Distefano, G.; Colonna, F.P., Gas phase UPS investigation of trans-azobenzenes, Z. Naturforsch. A:, 1979, 34, 1496. [all data]