Tricyclo[4.2.2.02,5]deca-7,9-diene

Gas phase ion energetics data

Data compiled by: Sharon G. Lias, Rhoda D. Levin, and Sherif A. Kafafi

Ionization energy determinations

IE (eV) Method Reference Comment
8.8PEBruckmann and Klessinger, 1972Vertical value

References

Bruckmann and Klessinger, 1972
Bruckmann, P.; Klessinger, M., Photoelektronenspektren ungesattigter Systeme mit Cyclopropan- und Cyclobutanringen, Angew. Chem., 1972, 84, 543. [all data]