Pentane, 1,2-dichlorodecafluoro-

Reaction thermochemistry data

Data compiled by: Hussein Y. Afeefy, Joel F. Liebman, and Stephen E. Stein

Individual Reactions

C5F10 + Chlorine = C5Cl2F10

By formula: C5F10 + Cl2 = C5Cl2F10

Quantity Value Units Method Reference Comment
Δr-190.8 ± 1.7kJ/molCmLacher, Kianpour, et al., 1957gas phase

References

Lacher, Kianpour, et al., 1957
Lacher, J.R.; Kianpour, A.; Park, J.D., Reaction heats of organic halogen compounds. VIII. The heats of chlorination of perfluorinated butene-1 pentene-1 and isobutene, J. Phys. Chem., 1957, 61, 584-586. [all data]