1,4-Dibromo-2,3-dichlorohexafluorobutane

Phase change data

Data compiled by: William E. Acree, Jr., James S. Chickos

Enthalpy of vaporization

ΔvapH (kcal/mol) Temperature (K) Method Reference
11.4 ± 0.02308.CSvoboda, Kubes, et al., 1992
11.2 ± 0.02315.CSvoboda, Kubes, et al., 1992

References

Svoboda, Kubes, et al., 1992
Svoboda, V.; Kubes, V.; Basarova, P., Enthalpies of vaporization and cohesive energies of 1,1,2,2-tetrachloro-1,2-difluoroethane, 1,2-dibromoethane, 1-bromo-2-chloroethane, 1,3-dibromo-propane, and 1,4-dibromo-2,3-dichloro-1,1,2,3,4,4-hexafluorobutane, J. Chem. Thermodyn., 1992, 24, 555-558. [all data]