Butanal, heptafluoro-

Phase change data

Data compiled as indicated in comments:
BS - Robert L. Brown and Stephen E. Stein
TRC - Thermodynamics Research Center, NIST Boulder Laboratories, Chris Muzny director

Quantity Value Units Method Reference Comment
Tboil368. - 369.KN/APCR Inc., 1990BS
Tboil302.KN/ABraid, Iserson, et al., 1954Uncertainty assigned by TRC = 4. K; TRC

In addition to the Thermodynamics Research Center (TRC) data available from this site, much more physical and chemical property data is available from the following TRC products:

References

PCR Inc., 1990
PCR Inc., Research Chemicals Catalog 1990-1991, PCR Inc., Gainesville, FL, 1990, 1. [all data]

Braid, Iserson, et al., 1954
Braid, M.; Iserson, H.; Lawlor, F.E., An Improved Synthesis of Perfluoroaldehydes, J. Am. Chem. Soc., 1954, 76, 4027. [all data]