1,3,2-Dioxaphospholane, 2-ethylamino-

Gas phase ion energetics data

Data compiled by: Sharon G. Lias, John E. Bartmess, Joel F. Liebman, John L. Holmes, Rhoda D. Levin, and W. Gary Mallard

Ionization energy determinations

IE (eV) Method Reference Comment
8.60PEWorley, Hargis, et al., 1982Vertical value

References

Worley, Hargis, et al., 1982
Worley, S.D.; Hargis, J.H.; Chang, L.; Mattson, G.A.; Jennings, W.B., The UPS of some compounds containing the heteroatoms phosphorus, nitrogen and oxygen, J. Electron Spectrosc. Relat. Phenom., 1982, 25, 135. [all data]