2-Pyridinemethanamine

Phase change data

Data compiled by: Robert L. Brown and Stephen E. Stein

Reduced pressure boiling point

Tboil (K) Pressure (bar) Reference
356.70.016Aldrich Chemical Company Inc., 1990
364.20.020Weast and Grasselli, 1989
364.0.020Buckingham and Donaghy, 1982
355.0.016Buckingham and Donaghy, 1982

Kovats' RI, polar column, isothermal

Data compiled by: NIST Mass Spectrometry Data Center, William E. Wallace, director

Column type Capillary
Active phase PEG-40M
Column length (m) 50.
Carrier gas He
Substrate
Column diameter (mm) 0.3
Phase thickness (μm) 0.4
Temperature (C) 150.
I 1748.
ReferenceTerenina, Zhuravieva, et al., 1997
Comment MSDC-RI

References

Aldrich Chemical Company Inc., 1990
Aldrich Chemical Company Inc., Catalog Handbook of Fine Chemicals, Aldrich Chemical Company, Inc., Milwaukee WI, 1990, 1. [all data]

Weast and Grasselli, 1989
CRC Handbook of Data on Organic Compounds, 2nd Editon, Weast,R.C and Grasselli, J.G., ed(s)., CRC Press, Inc., Boca Raton, FL, 1989, 1. [all data]

Buckingham and Donaghy, 1982
Buckingham, J.; Donaghy, S.M., Dictionary of Organic Compounds: Fifth Edition, Chapman and Hall, New York, 1982, 1. [all data]