FPO2

Ion clustering data

Data compiled by: Michael M. Meot-Ner (Mautner) and Sharon G. Lias

Clustering reactions

Fluorine anion + FO2P = (Fluorine anion • FO2P)

By formula: F- + FO2P = (F- • FO2P)

Quantity Value Units Method Reference Comment
Δr90. ± 15.kcal/molICRLarson and McMahon, 1987gas phase; bracketing

References

Larson and McMahon, 1987
Larson, J.W.; McMahon, T.B., Trends in Gas Phase Fluoride Ion Affinities of the Main Group Oxyfluorides and Fluoride Sulfides. Fluoride Adducts of FAsO, FPO, FPO2, F2SiO, F4SO, FBO, F2SiS, FPS, FAsS, F2S2, and S2O., Inorg. Chem., 1987, 26, 24, 4018, https://doi.org/10.1021/ic00271a011 . [all data]