3-CF3C6H4C(CH3)=CH2

Gas phase ion energetics data

Data evaluated by: Edward P. Hunter and Sharon G. Lias

Quantity Value Units Method Reference Comment
Proton affinity (review)823.7kJ/molN/AHunter and Lias, 1998
Quantity Value Units Method Reference Comment
Gas basicity794.8kJ/molN/AHunter and Lias, 1998

References

Hunter and Lias, 1998
Hunter, E.P.; Lias, S.G., Evaluated Gas Phase Basicities and Proton Affinities of Molecules: An Update, J. Phys. Chem. Ref. Data, 1998, 27, 3, 413-656, https://doi.org/10.1063/1.556018 . [all data]