(Z)-3-Pentenoic acid, methyl ester

Reaction thermochemistry data

Data compiled by: Hussein Y. Afeefy, Joel F. Liebman, and Stephen E. Stein

Individual Reactions

(E)-Pent-3-enoic acid methyl ester = (Z)-3-Pentenoic acid, methyl ester

By formula: C6H10O2 = C6H10O2

Quantity Value Units Method Reference Comment
Δr-3.2kJ/molEqkHine, Kanagasabapathy, et al., 1982liquid phase

References

Hine, Kanagasabapathy, et al., 1982
Hine, J.; Kanagasabapathy, V.M.; Ng, P., Double bond stabilizing abilities of formyl, carbo-tert-butoxy, and carbomethoxy substituents, J. Org. Chem., 1982, 47, 2745-2748. [all data]