1-Hydroxy-2,2,6,6-tetramethyl-4-piperidinone

Phase change data

Data compiled as indicated in comments:
AC - William E. Acree, Jr., James S. Chickos
ALS - Hussein Y. Afeefy, Joel F. Liebman, and Stephen E. Stein

Enthalpy of sublimation

ΔsubH (kJ/mol) Temperature (K) Method Reference Comment
80.0303.AStephenson and Malanowski, 1987Based on data from 288. - 328. K.; AC
80.1 ± 4.3288.VKalashnikova, Rozantsev, et al., 1965ALS

References

Stephenson and Malanowski, 1987
Stephenson, Richard M.; Malanowski, Stanislaw, Handbook of the Thermodynamics of Organic Compounds, 1987, https://doi.org/10.1007/978-94-009-3173-2 . [all data]

Kalashnikova, Rozantsev, et al., 1965
Kalashnikova, L.A.; Rozantsev, E.G.; Chaikin, A.M., Saturated vapor pressure of certain stable free radicals, Bull. Acad. Sci. USSR, Div. Chem. Sci., 1965, 782-785. [all data]