Imidazolidine,2-(2-methylphenylimino)-

Gas phase ion energetics data

Data compiled by: Sharon G. Lias, Rhoda D. Levin, and Sherif A. Kafafi

Ionization energy determinations

IE (eV) Method Reference Comment
7.75PEde Jong and Van Dam, 1980Vertical value

References

de Jong and Van Dam, 1980
de Jong, A.P.; Van Dam, H., Ultraviolet photoelectron spectroscopy of cyclic amidines. 2. Electronic structure of clonidine and some related 2-(phenylimino)imidazolidines with α-adrenergic activity, J. Med. Chem., 1980, 23, 889. [all data]