4-Piperidinone, 1-(phenylmethyl)-

Phase change data

Data compiled as indicated in comments:
BS - Robert L. Brown and Stephen E. Stein
AC - William E. Acree, Jr., James S. Chickos

Quantity Value Units Method Reference Comment
Δvap78.0 ± 0.8kJ/molCRibeiro da Silva and Cabral, 2006AC

Reduced pressure boiling point

Tboil (K) Pressure (bar) Reference Comment
407.20.009Aldrich Chemical Company Inc., 1990BS

References

Ribeiro da Silva and Cabral, 2006
Ribeiro da Silva, Manuel A.V.; Cabral, Joana I.T.A., Thermochemistry of Some Derivatives of 2- and 4-Piperidone, J. Chem. Eng. Data, 2006, 51, 5, 1556-1561, https://doi.org/10.1021/je060046t . [all data]

Aldrich Chemical Company Inc., 1990
Aldrich Chemical Company Inc., Catalog Handbook of Fine Chemicals, Aldrich Chemical Company, Inc., Milwaukee WI, 1990, 1. [all data]