1,1,1,4,4,4-Hexafluoro-2,3-bis(trifluoromethyl)but-2-ene

Gas phase ion energetics data

Data compiled by: Sharon G. Lias, Rhoda D. Levin, and Sherif A. Kafafi

Ionization energy determinations

IE (eV) Method Reference Comment
12.61PERobin, Taylor, et al., 1973Vertical value

References

Robin, Taylor, et al., 1973
Robin, M.B.; Taylor, G.N.; Kuebler, N.A.; Bach, R.D., Planarity of the carbon skeleton in various alkylated olefins, J. Org. Chem., 1973, 38, 1049. [all data]