1-amino-2,2-bis(hydroxymethyl)-1,3-propanediol

Phase change data

Data compiled by: Thermodynamics Research Center, NIST Boulder Laboratories, Chris Muzny director

Quantity Value Units Method Reference Comment
Tfus477.KN/AMurrill, Whitehead, et al., 1972Crystal phase 1 phase; Uncertainty assigned by TRC = 4. K

In addition to the Thermodynamics Research Center (TRC) data available from this site, much more physical and chemical property data is available from the following TRC products:

References

Murrill, Whitehead, et al., 1972
Murrill, E.; Whitehead, M.E.; Breed, L., Solid-solid phase transition determined by differential scanning calori- meter, Thermochim. Acta, 1972, 3, 311. [all data]