C8H11FSi

Reaction thermochemistry data

Data compiled by: John E. Bartmess

Individual Reactions

C8H10FSi- + Hydrogen cation = C8H11FSi

By formula: C8H10FSi- + H+ = C8H11FSi

Quantity Value Units Method Reference Comment
Δr1577. ± 9.2kJ/molG+TSIrie, Kikukawa, et al., 2001gas phase; The anion may be ArSiH(Me)CH2-, based on LFER size and ab initio calculations - JEB
Quantity Value Units Method Reference Comment
Δr1544. ± 8.4kJ/molIMREIrie, Kikukawa, et al., 2001gas phase; The anion may be ArSiH(Me)CH2-, based on LFER size and ab initio calculations - JEB

References

Irie, Kikukawa, et al., 2001
Irie, M.; Kikukawa, K.; Shimizu, N.; Mishima, M., Gas-phase acidities of aryldimethylsilanes, J. Chem. Soc. Perkin Trans., 2001, 2, 6, 923-928, https://doi.org/10.1039/b100488n . [all data]