(1α,3α,5α,7α)-3,8,8-trimethyl-4-oxatricyclo[5.1.0.03,5]octane

Condensed phase thermochemistry data

Data compiled by: Hussein Y. Afeefy, Joel F. Liebman, and Stephen E. Stein

Quantity Value Units Method Reference Comment
Δfliquid-35.39 ± 0.41kcal/molCcbAleshina, Kozina, et al., 1977
Δfliquid-35.39 ± 0.41kcal/molCcbKozina, Aleshina, et al., 1977
Quantity Value Units Method Reference Comment
Δcliquid-1451.65 ± 0.39kcal/molCcbAleshina, Kozina, et al., 1977Corresponding Δfliquid = -35.38 kcal/mol (simple calculation by NIST; no Washburn corrections)
Δcliquid-1451.65 ± 0.39kcal/molCcbKozina, Aleshina, et al., 1977Corresponding Δfliquid = -35.38 kcal/mol (simple calculation by NIST; no Washburn corrections)

References

Aleshina, Kozina, et al., 1977
Aleshina, V.A.; Kozina, M.P.; Gal'chenko, G.L., Enthalpy of formation of α-3,4- and β-3,4-epoxycaranes, Vses. Konf. Kalorim. Rasshir. Tezisy Dokl. 7th, 1977, 1, 85-91. [all data]

Kozina, Aleshina, et al., 1977
Kozina, M.P.; Aleshina, V.A.; Gal'chenko, G.L.; Deshchits, G.V.; Bardyshev, I.L., Enthalpies of formation of α- and β-3,4-epoxycaranes, Vestsi Akad. Nauk. BSSR, Ser. Khim. Nauk., 1977, 94-96. [all data]