Butanoic acid, heptafluoro-, ethyl ester

Kovats' RI, non-polar column, isothermal

View large format table.

Column type Active phase Temperature (C) I Reference Comment
CapillaryOV-101100.559.Promyshlennikova, Kirichenko, et al., 1992
CapillaryOV-101100.559.2Promyshlennikova, Kirichenko, et al., 1991He; Column length: 50. m; Column diameter: 0.25 mm

References

Promyshlennikova, Kirichenko, et al., 1992
Promyshlennikova, E.P.; Kirichenko, V.E.; Pashkevich, K.I.; Grigor'eva, D.N.; Golovnya, R.V., Influence of the stationary phase nature on the retention of polyfluorinated carboxylic acid esters, Zh. Anal. Khim., 1992, 47, 1070-1075. [all data]

Promyshlennikova, Kirichenko, et al., 1991
Promyshlennikova, E.P.; Kirichenko, V.E.; Pashkevich, K.I.; Grigor'eva, D.N.; Golovnya, R.V., Capillary chromatography of polyfluorinated carboxylic esters, Izv. Akad. Nauk SSSR Ser. Khim., 1991, 8, 1541-1545. [all data]