1,2,3,4-Tetrahydronaphthalene-cis-2,3-diol

Condensed phase thermochemistry data

Data compiled by: Hussein Y. Afeefy, Joel F. Liebman, and Stephen E. Stein

Quantity Value Units Method Reference Comment
Δcsolid-5228.7 ± 0.8kJ/molCcbVerkade, Coops, et al., 1928At 288 °K; Corresponding Δfsolid = -421.3 kJ/mol (simple calculation by NIST; no Washburn corrections)

References

Verkade, Coops, et al., 1928
Verkade, P.E.; Coops, J., Jr.; Maan, Chr.J., Calorimetrische Untersuchungen. XV. Thermochemische studien uber cycloparaffine und ihre derivate: 1. Experimentelle daten fur funf- und sechsgliedrige cyclische diole, Ann., 1928, 467, 217-239. [all data]