4-Nitrobenzoic acid, dodecyl ester

Kovats' RI, polar column, isothermal

Data compiled by: NIST Mass Spectrometry Data Center, William E. Wallace, director

Column type CapillaryCapillaryCapillary
Active phase OV-351OV-351OV-351
Column length (m) 25.25.25.
Carrier gas N2N2N2
Substrate
Column diameter (mm) 0.320.320.32
Phase thickness (μm)
Temperature (C) 180.200.220.
I 3288.3326.3341.
ReferenceKorhonen, 1986Korhonen, 1986Korhonen, 1986
Comment MSDC-RI MSDC-RI MSDC-RI

References

Korhonen, 1986
Korhonen, I.O.O., Gas-Liquid Chromatographic Analyses. XLV. Retention Behaviour of C1-C12 n-Alkyl Esters of Benzoic, 4-Nitrobenzoic and 3,5-Dinitrobenzoic Acids on SE-30 and OV-351 Capillary Columns, J. Chromatogr., 1986, 356, 285-299, https://doi.org/10.1016/S0021-9673(00)91489-4 . [all data]