Borane, fluorodimethyl-

Ion clustering data

Data compiled by: John E. Bartmess

Clustering reactions

Fluorine anion + C2H6BF = (Fluorine anion • C2H6BF)

By formula: F- + C2H6BF = (F- • C2H6BF)

Quantity Value Units Method Reference Comment
Δr61.80kcal/molIMRBMurphy and Beauchamp, 1977gas phase; Fluoride Affinity: Et3B > Me2BF > MeSiF3 > Me3B > SF4

References

Murphy and Beauchamp, 1977
Murphy, M.K.; Beauchamp, J.L., Fluorine and Alkyl Substituent Effects on Gas-Phase Lewis Acidities of Boranes by ICR Spectroscopy, Inorg. Chem., 1977, 16, 2437. [all data]